{"text_format":"1","workbook":"xlsx","n_sheets":4,"sheets":["Closed End Seconds (FL)","Feed(WS)","Cover Page","Sheet1"],"not_rendered":{"charts":0,"images":3,"macros":1,"external_links":0,"defined_names":2,"comments":0,"pivot_tables":0},"unopened":[],"bounds":{"document_bytes":16777216,"sheet_cells":100000,"rows_first":2000,"rows_last":500,"rows_between":2000,"halvings":0,"cell_chars":16384,"cell_head_chars":4096},"cells_cut":0,"cells_raw":0,"read":"whole","date_system":"1900"}

{"sheet":"Closed End Seconds (FL)","index":0,"n_rows":55,"n_cols":22,"rows_kept":55,"cut":false,"hidden":false,"merged":[[29,5,29,6],[39,5,39,6],[30,5,30,6],[31,5,31,6],[32,5,32,6],[33,5,33,6],[34,5,34,6],[36,17,47,24],[30,21,30,24],[32,21,32,24],[33,9,33,11],[34,9,34,11],[29,13,31,15],[30,17,35,20],[33,13,33,15],[34,13,36,15],[31,9,31,10],[29,21,29,24],[29,9,29,10],[30,9,30,10],[31,21,31,24],[28,9,28,11],[29,17,29,19],[28,13,28,15],[24,5,24,6],[24,9,24,10],[25,17,25,19],[25,9,25,10],[26,17,26,19],[27,5,27,6],[28,5,28,6],[27,17,27,19],[28,17,28,19],[24,17,24,18],[26,9,26,10],[25,13,25,15],[26,13,26,15],[25,5,25,6],[26,5,26,6],[22,17,22,18],[20,9,20,10],[20,13,20,15],[21,5,21,6],[21,9,21,10],[20,17,20,18],[21,17,21,18],[22,5,22,6],[22,13,22,15],[23,17,23,18],[23,5,23,6],[23,9,23,11],[23,13,23,15],[19,5,19,7],[19,9,19,11],[19,13,19,15],[19,17,19,18],[19,21,19,24],[18,21,18,24],[15,5,15,6],[15,17,15,18],[13,17,13,18],[13,5,13,6],[14,5,14,6],[14,17,14,18],[14,21,14,24],[16,5,16,6],[16,17,16,18],[16,21,16,24],[17,5,17,6],[17,17,17,18],[17,21,17,24],[11,17,11,18],[12,5,12,6],[12,17,12,18],[4,14,4,15],[18,17,18,18],[12,21,12,24],[5,0,6,15],[5,17,6,24],[7,17,7,18],[7,20,7,24],[8,0,8,3],[8,5,8,15],[8,17,8,18],[8,22,8,24],[9,17,9,18],[9,22,9,24],[10,5,10,6],[10,17,10,18],[10,22,10,24],[9,5,9,6],[11,5,11,6],[0,7,1,10],[0,14,1,15],[2,7,2,10],[3,7,3,10],[3,13,3,15]]}
[null,null,null,null,null,null,null,null,null,null,null,null,null,null,"Wholesale Ratesheet"]
[]
[null,null,null,null,null,null,null,"19000 MacArthur Blvd, Suite 300",null,null,null,null,null,null,null,"30 Day Lock Period"]
[null,null,null,null,null,null,null,"Irvine, CA 92612",null,null,null,null,null,"Borrower Paid Compensation"]
[null,null,null,null,null,null,null,null,null,null,null,null,null,"Effective Date:","2024-05-01"]
["Closed End Seconds",null,null,null,null,null,null,null,null,null,null,null,null,null,null,null,null,"Calculator does not verify eligibility.\nPlease use in conjunction with product matrix."]
[]
[null,null,null,null,null,null,null,null,null,null,null,null,null,null,null,null,null,null,null,"Inputs",{"$f":"O5","v":"2024-05-01"}]
["Base Rate / Base Price",null,null,null,null,"FICO/HCLTV Price Adjustments",null,null,null,null,null,null,null,null,null,null,null," Interest Rate →",null,0]
["Rate","Full Doc","Alt Doc",null,null,null,null,"HCLTV 00.01-50","HCLTV 50.01-55","HCLTV 55.01-60","HCLTV 60.01-65","HCLTV 65.01-70","HCLTV 70.01-75","HCLTV 75.01-80","HCLTV 80.01-85","HCLTV 85.01-90",null,"LTV Range",null,"Choose a Selection"]
[8.25,98.375,{"$error":"#N/A"},null,null,"≥ 800",null,0.375,0.25,0.125,-0.125,-0.25,-0.75,-1.625,-3.5,{"$error":"#N/A"},null,"FICO Range",null,"Choose a Selection",{"$f":"IF(T11=\"Choose a Selection\",0,IF(OR(T10='Feed(WS)'!B3:B5),INDEX(H11:H18,MATCH(T11,F11:F18,0)),INDEX(H11:P18,MATCH(T11,F11:F18,0),MATCH(T10,H10:P10,0))))","v":0}]
[8.375,98.625,{"$error":"#N/A"},null,null,"780 - 799",null,0.25,0.125,-0.125,-0.25,-0.375,-1,-1.875,-3.75,{"$error":"#N/A"},null,"Loan Program",null,"Choose a Selection",{"$f":"IF(T12=\"Choose a Selection\",0,INDEX($L$21:$L$22,MATCH($T$12,$J$21:$J$22,0)))","v":0}]
[8.5,98.875,98.375,null,null,"760 - 779",null,0.125,-0.125,-0.25,-0.375,-0.625,-1.375,-2.125,-4.25,{"$error":"#N/A"},null,"Doc Type",null,"Choose a Selection",{"$f":"IF(OR(T13=\"Choose a Selection\",T13='Feed(WS)'!C4,T13='Feed(WS)'!C5,T13='Feed(WS)'!C6),0,INDEX($H$22:$H$40,MATCH($T$13,$F$22:$F$40,0)))","v":0},{"$f":"'Feed(WS)'!B64","v":0}]
[8.625,99.125,98.625,null,null,"740 - 759",null,-0.125,-0.25,-0.375,-0.625,-1.125,-1.625,-2.75,-5.25,{"$error":"#N/A"},null,"Additional Adjustments",null,"Choose a Selection",{"$f":"IF(OR(T14=\"Choose a Selection\",T14='Feed(WS)'!D3),0,INDEX($H$22:$H$40,MATCH($T$14,$F$22:$F$40,0)))","v":0}]
[8.75,99.375,98.875,null,null,"720 - 739",null,-0.25,-0.375,-0.875,-1.125,-1.5,-2,-3.5,-6.5,{"$error":"#N/A"},null,"Citizenships",null,"Choose a Selection",{"$f":"IF(T15=\"Choose a Selection\",0,IF(OR(T15='Feed(WS)'!L3:L5),0,INDEX($H$22:$H$40,MATCH($T$15,$F$22:$F$40,0))))","v":0}]
[8.875,99.625,99.125,null,null,"700 - 719",null,-1,-1.25,-1.75,-2.25,-2.625,-2.875,-5,-7.75,{"$error":"#N/A"},null,"DTI",null,"Choose a Selection",{"$f":"IF(T16=\"Choose a Selection\",0,IF(OR(T16='Feed(WS)'!E6),0,INDEX($H$22:$H$40,MATCH($T$16,$F$22:$F$40,0))))","v":0}]
[9,99.875,99.375,null,null,"680 - 699",null,-2.5,-2.75,-3.25,-3.75,-4,-4.75,-7.25,{"$error":"#N/A"},{"$error":"#N/A"},null,"Loan Balance",null,"Choose a Selection",{"$f":"IF(OR(T17=\"Choose a Selection\",T17='Feed(WS)'!F3),0,INDEX($H$22:$H$40,MATCH($T$17,$F$22:$F$40,0)))","v":0}]
[9.125,100.125,99.625,null,null,"660 - 679",null,-3.5,-3.75,-4.25,-4.75,-5,-6.25,{"$error":"#N/A"},{"$error":"#N/A"},{"$error":"#N/A"},null,"Occupancy",null,"Choose a Selection",{"$f":"IF(T18=\"Choose a Selection\",0,IF(OR(T18='Feed(WS)'!I3),0,INDEX($H$22:$H$40,MATCH($T$18,$F$22:$F$40,0))))","v":0}]
[9.25,100.375,99.875,null,null,null,null,null,null,null,null,null,null,null,null,null,null,"Property Type",null,"Choose a Selection",{"$f":"IF(T19=\"Choose a Selection\",0,IF(OR(T19='Feed(WS)'!H3),0,INDEX($H$22:$H$40,MATCH($T$19,$F$22:$F$40,0))))","v":0}]
[9.375,100.625,100.125,null,null,"Loan Level Price Adjustments",null,null,null,"Loan Program",null,null,null,"Max Price",null,null,null,"Loan Term",null,"30YR Fixed",{"$f":"INDEX($L$25:$L$27,MATCH($T$20,$J$25:$J$27,0))","v":0}]
[9.5,100.875,100.375,null,null,null,null,"LLPA",null,"Standalone Second",null,0,null,102,null,null,null,"State",null,"Choose a Selection",0]
[9.625,101.375,100.875,null,null,"Select Full Doc",null,1,null,"Concurrent Second",null,0,null,null,null,null,null,"Credit Event",null,"Choose a Selection",0]
[9.75,101.875,101.375,null,null,"Investment Property",null,-4,null,null,null,null,null,"NC Floor Price",null,null,null,"Housing History",null,"Choose a Selection",0]
[9.875,102.375,101.875,null,null,"Second Home",null,-1,null,"Loan Term",null,null,null,99.75,null,null,null,"Lock Term",null,"30 Day",{"$f":"INDEX($L$30:$L$32,MATCH($T$24,$J$30:$J$32,0))","v":0}]
[10,102.875,102.375,null,null,"2 - 4 Units",null,-0.5,null,"30YR Fixed",null,0,null,null,null,null,null,{"$f":"IF(U25=0,\"\",IF(U25=0.25,\"CES Special\",\"CES/State Special\"))","v":""},null,{"$f":"IF(U25=0,\"Not Applicable\",\"Yes\")","v":"Not Applicable"},{"$f":"IF(T10<>\"Choose a Selection\",IF(OR(T21='Feed(WS)'!N3,T21='Feed(WS)'!N5:N6),0.5,0.25),0)","v":0}]
[10.125,103.125,102.625,null,null,"Condo",null,-0.5,null,"20YR Fixed",null,0.125,null,"Max Rate (CA)",null,null,null,"  Total LLPA",null,null,{"$f":"SUM(U11:U25)+V13","v":0}]
[10.25,103.375,102.875,null,null,"$100,001-$125,000",null,0.25,null,"10YR Fixed",null,0.125,null,12.25,null,null,null,"  Gross Rate Sheet Price (Prior to LLPAs)",null,null,{"$f":"INDEX(A10:D55,MATCH(T9,A10:A55,0),MATCH(IF(T13='Feed(WS)'!C3,'Feed(WS)'!C4,T13),B10:D10,0)+1)","v":{"$error":"#N/A"}}]
[10.375,103.625,103.125,null,null,"$125,001-$150,000",null,0.375,null,null,null,null,null,null,null,null,null,"  Net Price: Rate Sheet - LLPA (Prior to Min/Max YSP)",null,null,{"$f":"IFERROR(IF(AND(T9<>'Feed(WS)'!K137,U29=N24),NA(),U27+U26),\"Minimum Rate\")","v":"Minimum Rate"}]
[10.5,103.875,103.375,null,null,"$150,001-$350,000",null,0.5,null,"Lock Days",null,null,null,"CES SPECIAL",null,null,null,"  Max YSP",null,null,{"$f":"'Feed(WS)'!E136","v":0}]
[10.625,104.125,103.625,null,null,"$350,001-$500,000",0,0.5,null,"15 Day",null,0,null,"25 BPS on all CES Loans\n*Can be combined with Select",null,null,null,"Final Price  →",null,null,{"$f":"IF(OR(U26=\"#NA\",U27=\"#NA\",U28=\"Minimum Rate\"),NA(),IF(AND(IF(U28>U29,U29,U28)<'Feed(WS)'!E147,T21='Feed(WS)'!N5),NA(),IF(U28>U29,U29,U28)))","v":{"$error":"#N/A"}}]
[10.75,104.375,103.875,null,null,"$500,001-$750,000",0,0,null,"30 Day",null,0,null,null,null,null,null,"• Borrower Paid Compensation Only, Max 2.000%\n• No Underwriting Fee Buyout"]
[10.875,104.625,104.125,null,null,"Asset Utilization",0,-0.5,null,"45 Day",null,-0.5,null,null,null,null,null,null,null,null,null,{"$f":"IF(OR(T10:T24=\"Choose a Selection\"),\"\",CONCATENATE('Feed(WS)'!I137,\" \",'Feed(WS)'!K137,\"%\"&\" @ \"&'Feed(WS)'!L137))","v":""}]
[11,104.875,104.375,null,null,"1099 Only",0,-0.5]
[11.125,105.125,104.625,null,null,"WVOE Only",0,-0.5,null,"Allowable Fees",null,null,null,"STATE SPECIAL"]
[11.25,105.375,104.875,null,null,"1yr Self Employed",0,-0.5,null,"Click Here",null,null,null,"25 BPS on all CES Loans\n*Excludes California\n*Can be combined with CES Special and Select\n*Ends at the end of May"]
[11.375,105.625,105.125,null,null,"ITIN",null,-2.5]
[11.5,105.875,105.375,null,null,"Foreign Nat' With Fico",null,-1.5,null,null,null,null,null,null,null,null,null,"Temporary Guidance See Below\nExtension Cost\n\n2 bps / day\nExtension Cost\n\nCurrent lock extension costs/policies apply to all active locks, regardless of lock date\n\nAll 45 day locks are at a 50bp cost and are not eligible for lock extensions\n"]
[11.625,106.125,105.625,null,null,"DTI 00.01-43",null,0]
[11.75,106.375,105.875,null,null,"DTI 43.01-45",null,-0.5]
[11.875,106.625,106.125,null,null,"DTI 45.01-50",0,-1]
{"$rows_left_out":16}
{"sheet":"Feed(WS)","index":1,"n_rows":147,"n_cols":29,"rows_kept":147,"cut":false,"hidden":true,"merged":[[131,1,131,3],[79,1,79,4],[132,1,132,3],[144,1,144,3],[145,1,145,3],[140,1,140,3],[141,1,141,3],[136,8,136,9],[137,8,137,9]]}
["FICO","LTV","Doc Type","Additional Adjustments","DTI","Loan Amount","Prepayment Penalties","Property Type","Occupancy","Term","Lock Period","Citizenships","Loan Program","State","Credit Event","Housing History"]
["Choose a Selection","Choose a Selection","Choose a Selection","Choose a Selection","Choose a Selection","Choose a Selection","Choose a Selection","Choose a Selection","Choose a Selection","Choose a Selection","Choose a Selection","Choose a Selection","Choose a Selection","Choose a Selection","Choose a Selection","Choose a Selection"]
["≥ 800","HCLTV 00.01-40","Select Full Doc","None in this Dropdown","DTI 00.01-43",{"$f":"100000","v":100000},"No PPP","1 Unit","Primary","30YR Fixed","15 Day","US Citizen","Standalone Second","All Other States","Credit Event < 48 Months","0x30x12",null,null,null,null,null,null," "]
["780 - 799","HCLTV 40.01-45","Full Doc","Asset Utilization","DTI 43.01-45","$100,001-$125,000","12 Months","2 - 4 Units","Second Home","20YR Fixed","30 Day","Permanent Resident","Concurrent Second","California","Credit Event ≥ 48 and < 84 Months","0x30x24",null,null,null,null,null,null," "]
["760 - 779","HCLTV 45.01-50","Alt Doc","1099 Only","DTI 45.01-50","$125,001-$150,000","24 Months","Condo","Investment Property","10YR Fixed","45 Day","Non Perm Resident",null,"North Carolina","Credit Event ≥ 84 Months","Other",null,null,null,null,null,null," "]
["740 - 759","HCLTV 50.01-55","DSCR","WVOE Only","No DTI Program","$150,001-$350,000",null,null,null,null,null,"ITIN",null,"Tennessee",null,null,null,null,null,null,null,null," "]
["720 - 739","HCLTV 55.01-60",null,"1yr Self Employed",null,"$350,001-$500,000",null,null,null,null,null,"Foreign Nat' With Fico",null,null,null,null,null,null,null,null,null,null," "]
["700 - 719","HCLTV 60.01-65",null,"DSCR - STR",null,"$500,001-$750,000",null,null,null,null,null,null,null,null,null,null,null,null,null,null,null,null," "]
["680 - 699","HCLTV 65.01-70",null,null,null,null,null,null,null,null,null,null,null,null,null,null,null,null,null,null,null,null," "]
["660 - 679","HCLTV 70.01-75",null,null,null,null,null,null,null,null,null,null,null,null,null,null,null,null,null,null,null,null," "]
[null,"HCLTV 75.01-80"]
[null,"HCLTV 80.01-85",null,null,null,null,null,null,null,null,null,null,null,null,null,null,null,null,null,null,null,null," "]
[null,"HCLTV 85.01-90",null,null,null,null,null,null,null,null,null,null,null,null,null,null,null,null,null,null,null,null," "]
[]
[]
[]
[]
[]
[]
[]
[]
[null,null,null,null,null,null,null,null,null,null,null,null,null,null,null,null,null,null,null,null,null,null,null,null,null,null," "]
[null,null,null,null,null,null,null,null,null,null,null,null,null,null,null,null,null,null,null,null,null,null,null,null,null,null," "]
[null,null,null,null,null,null,null,null,null,null,null,null,null,null,null,null,null,null,null,null,null,null,null,null,null,null,null,null," "]
[null,null,null,null,null,null,null,null,null,null,null,null,null,null,null,null,null,null,null,null,null,null,null,null,null,null,null,null," "]
[null,null,null,null,null,null,null,null,null,null,null,null,null,null,null,null,null,null,null,null,null,null,null,null,null,null,null,null," "]
[null,null,null,null,null,null,null,null,null,null,null,null,null,null,null,null,null,null,null,null,null,null,null,null,null,null,null,null," "]
[null,null,null,null,null,null,null,null,null,null,null,null,null,null,null,null,null,null,null,null,null,null,null,null,null,null,null,null," "]
[null,null,null,null,null,null,null,null,null,null,null,null,null,null,null,null,null,null,null,null,null,null,null,null,null,null,null,null," "]
[null,null,null,null,null,null,null,null,null,null,null,null,null,null,null,null,null,null,null,null,null,null,null,null,null,null,null,null," "]
[null,null,null,null,null,null,null,null,null,null,null,null,null,null,null,null,null,null,null,null,null,null,null,null,null,null,null,null," "]
[null,null,null,null,null,null,null,null,null,null,null,null,null,null,null,null,null,null,null,null,null,null,null,null,null,null,null,null," "]
[null,null,null,null,null,null,null,null,null,null,null,null,null,null,null,null,null,null,null,null,null,null,null,null,null,null,null,null," "]
[null,null,null,null,null,null,null,null,null,null,null,null,null,null,null,null,null,null,null,null,null,null,null,null,null,null,null,null," "]
[null,null,null,null,null,null,null,null,null,null,null,null,null,null,null,null,null,null,null,null,null,null,null,null,null,null,null,null," "]
[]
[null,null,null,null,null,null,null,null,null,null,null,null,null,null,null,null,null,null,null,null,null,null,null,null,null,null,null,null," "]
["Disqualifiers",null,null,null,"Full Doc Disqualifiers",null,"Alt Doc Disqualifiers",null,"Select Full Doc Disqualifiers",null,"DSCR Disqualifiers",null,null,null,null,null,null,null,null,null,null,null,null,null,null,null,null,null," "]
["NAs on DTI >45% on LTVs>80%",{"$f":"IF(AND(OR('Closed End Seconds (FL)'!T10=B12:B13),'Closed End Seconds (FL)'!T16=E5),NA(),\"\")","v":""},null,null,"NAs on Primary/100k-350k/LTVs>85%/FICOs<720",{"$f":"IF(AND(OR('Closed End Seconds (FL)'!T17=F4:F6),OR('Closed End Seconds (FL)'!T18=I3),OR('Closed End Seconds (FL)'!T10=B13),OR('Closed End Seconds (FL)'!T11=A8:A10)),NA(),\"\")","v":""},"NAs on Primary/100k-350k/LTVs>85%",{"$f":"IF(AND(OR('Closed End Seconds (FL)'!T17=F4:F6),OR('Closed End Seconds (FL)'!T18=I3),OR('Closed End Seconds (FL)'!T10=B13),OR('Closed End Seconds (FL)'!T13=C5)),NA(),\"\")","v":""},"NAs on Primary/100k-350k/LTVs>80%/All FICOs",{"$f":"IF(AND(OR('Closed End Seconds (FL)'!T17=F4:F6),OR('Closed End Seconds (FL)'!T18=I3),OR('Closed End Seconds (FL)'!T10=B12:B13),OR('Closed End Seconds (FL)'!T11=A3:A10),OR('Closed End Seconds (FL)'!T13=C3)),NA(),\"\")","v":""},"NAs on NOO/100k-350k/LTVs>75%",{"$f":"IF(AND(OR('Closed End Seconds (FL)'!T17=F4:F6),OR('Closed End Seconds (FL)'!T18=I5),OR('Closed End Seconds (FL)'!T10=B11:B13),OR('Closed End Seconds (FL)'!T13=C6)),NA(),\"\")","v":""},null,null,null,null,null,null,null,null,null,null,null,null,null,null,null,null," "]
[null,null,null,null,"NAs on Primary/100k-350k/LTVs>80%/FICOs<700",{"$f":"IF(AND(OR('Closed End Seconds (FL)'!T17=F4:F6),OR('Closed End Seconds (FL)'!T18=I3),OR('Closed End Seconds (FL)'!T10=B12:B13),OR('Closed End Seconds (FL)'!T11=A9:A10)),NA(),\"\")","v":""},"NAs on Primary/100k-350k/LTVs>80%/FICOs<720",{"$f":"IF(AND(OR('Closed End Seconds (FL)'!T17=F4:F6),OR('Closed End Seconds (FL)'!T18=I3),OR('Closed End Seconds (FL)'!T10=B12:B13),OR('Closed End Seconds (FL)'!T11=A8:A10),OR('Closed End Seconds (FL)'!T13=C5)),NA(),\"\")","v":""},"NAs on Primary/100k-350k/LTVs>75%/FICOs<700",{"$f":"IF(AND(OR('Closed End Seconds (FL)'!T17=F4:F6),OR('Closed End Seconds (FL)'!T18=I3),OR('Closed End Seconds (FL)'!T10=B11:B13),OR('Closed End Seconds (FL)'!T11=A9:A10),OR('Closed End Seconds (FL)'!T13=C3)),NA(),\"\")","v":""},"NAs on NOO/100k-350k/LTVs>70%/FICOs<720",{"$f":"IF(AND(OR('Closed End Seconds (FL)'!T17=F4:F6),OR('Closed End Seconds (FL)'!T18=I5),OR('Closed End Seconds (FL)'!T10=B10:B13),OR('Closed End Seconds (FL)'!T11=A8:A10),OR('Closed End Seconds (FL)'!T13=C6)),NA(),\"\")","v":""},null,null,null,null,null,null,null,null,null,null,null,null,null,null,null,null," "]
{"$rows_left_out":108}
{"sheet":"Cover Page","index":2,"n_rows":45,"n_cols":18,"rows_kept":45,"cut":false,"hidden":true,"merged":[[44,1,44,21],[43,1,43,21],[36,2,36,3],[38,2,38,3],[36,5,36,6],[38,5,38,6],[36,8,36,9],[38,8,38,9],[38,17,38,19],[29,13,38,15],[29,2,29,3],[29,4,29,5],[30,6,30,8],[29,6,29,8],[30,2,30,3],[34,17,34,19],[13,13,13,20],[13,2,13,4],[14,3,14,4],[15,2,15,4],[16,2,16,4],[15,5,15,6],[16,5,16,6],[21,2,21,3],[21,4,21,5],[22,2,22,3],[22,4,22,5],[23,2,23,3],[23,4,23,5],[28,2,28,3],[28,4,28,5],[25,2,25,3],[27,2,27,3],[26,2,26,3],[26,4,26,5],[23,13,24,15],[11,1,11,21],[15,17,15,19],[24,17,24,19],[13,8,13,10],[14,8,16,10],[19,13,20,15],[17,13,18,15],[13,5,13,6],[18,17,18,20],[14,5,14,6],[20,17,20,19],[14,13,16,15],[19,2,19,9],[21,13,22,15],[24,2,24,3],[20,6,20,8],[20,2,20,3],[20,4,20,5],[36,17,36,19],[25,13,26,15],[27,13,28,15],[32,17,32,19],[30,17,30,19],[28,17,28,19],[26,17,26,19],[30,4,30,5],[21,6,21,8],[22,6,22,8],[23,6,23,8],[24,6,24,8],[28,6,28,8],[24,4,24,5],[26,6,26,8],[27,6,27,8],[25,4,25,5],[27,4,27,5],[25,6,25,8]]}
[]
[]
[]
[]
[null,null,null,null,null,null,null,null,null,"19000 MacArthur Boulevard, 2nd Floor"]
[null,null,null,null,null,null,null,null,null,"Irvine, CA 92612"]
[]
[]
[]
[]
[]
[null,"LoanStream Mortgage Wholesale NANQ Rate Sheet"]
[]
[null,null,"Underwriting Fee",null,null,"Relock Fee",null,null,"Mortgagee Clause",null,null,null,null,"Contact list"]
[null,null,"NANQ",1295,null,-0.25,null,null,"OCMBC, INC. ISAOA \n19000 MacArthur Blvd, Ste. 200 Irvine, CA 92612",null,null,null,null,"Corporate \nHeadquarters:",null,null,"Phone:","800-760-1833"]
[null,null,"DOC Fee - All Loans",null,null,"Extension Fee",null,null,null,null,null,null,null,null,null,null,"Email:","Inquires@LSMortgage.com"]
[null,null,79,null,null,"0.02/Day"]
[null,null,null,null,null,null,null,null,null,null,null,null,null,"NAN-Q\n Prequals",null,null,"Phone:","Email Only"]
[null,null,null,null,null,null,null,null,null,null,null,null,null,null,null,null,"Email:","EZQual@LSMortgage.com"]
[null,null,"Current Turn Times",null,null,null,null,null,null,null,null,null,null,"U/W Loan \nScenarios NAN-Q",null,null,"Phone:","Email Only"]
[null,null,"Stage",null,"Turn Times",null,"Department Hours",null,null,"Cutoff Time",null,null,null,null,null,null,"Email:","NANQScenario@LSMortgage.com"]
[null,null,"PreQual",null,"24-48 Hours",null,"PreQual Desk Hours: 8:00 AM-5:00 PM PST",null,null,"3:00 PM PST",null,null,null,"Submission Desk",null,null,"Phone:","Email Only"]
[null,null,"Set-up",null,"24-48 Hours",null,"Setup Desk Hours: 8:00 AM-6:00 PM PST",null,null,null,null,null,null,null,null,null,"Email:","Submissions_LS@LSMortgage.com"]
[null,null,"New Underwrite",null,"24-48 Hours",null,"Underwriting Hours: 7:00 AM-6:00 PM PST",null,null,"3:00 PM PST",null,null,null,"Lock Desk:",null,null,"Phone:","949-679-7059"]
[null,null,"Conditions Review",null,"24-48 Hours",null,"Underwriting Hours: 7:00 AM-6:00 PM PST",null,null,"3:00 PM PST",null,null,null,null,null,null,"Email:","LockDesk@LSMortgage.com"]
[null,null,"Part \"A\" QC",null,"48-72 Hours",null,"PreQual Desk Hours: 8:00 AM-5:00 PM PST",null,null,"3:30 PM PST",null,null,null,"CD Desk:",null,null,"Phone:","Email Only"]
[null,null,"Lock Desk",null,"SameDay",null,"Lock Desk Hours are: 8:30 AM - 5:00 PM PST",null,null,"5:00 PM PST",null,null,null,null,null,null,"Email:","CD@LSMortgage.com"]
[null,null,"CTC Review",null,"SameDay",null,"Underwriting Hours: 7:00 AM-6:00 PM PST",null,null,"1:00 PM PST",null,null,null,"Funding Department:",null,null,"Phone:","Email Only"]
[null,null,"CD",null,"SameDay",null,"CD Desk Hours: 7:30 AM-6:00 PM PST",null,null,"12:00 PM PST",null,null,null,null,null,null,"Email:","Funding@LSMortgage.com"]
[null,null,"DOCS",null,"SameDay",null,"DOCS Desk Hours: 7:30 AM-6:00 PM PST",null,null,"12:00 PM PST",null,null,null,"Management \nEscalations",null,null,"Name:","David Racer / Operations"]
[null,null,"Funding",null,"SameDay",null,"Funding Desk Hours: 5:30 AM-5:00 PM PST",null,null,"12:30 PM PST",null,null,null,null,null,null,"Email:","DRacer@LSMortgage.com"]
[null,null,null,null,null,null,null,null,null,null,null,null,null,null,null,null,"Name:","Natalie Hernandez / Closing"]
[null,null,null,null,null,null,null,null,null,null,null,null,null,null,null,null,"Email:","NHernandez@LSMortgage.com"]
[null,null,null,null,null,null,null,null,null,null,null,null,null,null,null,null,"Name:","Nikki Allen / Underwriting"]
[null,null,null,null,null,null,null,null,null,null,null,null,null,null,null,null,"Email:","NAllen@LSMortgage.com"]
[null,null,null,null,null,null,null,null,null,null,null,null,null,null,null,null,"Name:","Adam Elway / Capital Markets"]
[null,null,null,null,null,null,null,null,null,null,null,null,null,null,null,null,"Email:","AElway@LSMortgage.com"]
[null,null,null,null,null,null,null,null,null,null,null,null,null,null,null,null,"Name:","Moe Aziz / Secondary"]
[null,null,null,null,null,null,null,null,null,null,null,null,null,null,null,null,"Email:","MAziz@LSMortgage.com"]
[]
{"$rows_left_out":6}
{"sheet":"Sheet1","index":3,"n_rows":0,"n_cols":0,"rows_kept":0,"cut":false,"hidden":true,"merged":[]}