{"text_format":"1","workbook":"xlsx","n_sheets":4,"sheets":["Feed(WS)","NonQM Program","Cover Page","Sheet1"],"not_rendered":{"charts":0,"images":3,"macros":1,"external_links":0,"defined_names":2,"comments":0,"pivot_tables":0},"unopened":[],"bounds":{"document_bytes":16777216,"sheet_cells":100000,"rows_first":2000,"rows_last":500,"rows_between":2000,"halvings":0,"cell_chars":16384,"cell_head_chars":4096},"cells_cut":0,"cells_raw":0,"read":"whole","date_system":"1900"}

{"sheet":"Feed(WS)","index":0,"n_rows":181,"n_cols":29,"rows_kept":181,"cut":false,"hidden":true,"merged":[[79,1,79,5],[0,17,0,18],[180,1,180,2],[179,1,179,2],[176,1,176,2],[79,8,79,11],[123,1,123,4],[127,8,127,11],[177,1,177,2],[19,0,19,2],[20,0,20,1],[21,0,21,1],[22,0,22,1],[23,0,23,1],[29,0,29,1],[30,0,30,1],[24,0,24,1],[25,0,25,1],[26,0,26,1],[27,0,27,1],[28,0,28,1]]}
["FICO","LTV","Grades","Doc Type","Additional Adjs","DTI","Loan Amount","Prepayment Penalties","Escrow Waiver","Purpose","Property Type","Occupancy","Term","Lock Period","Comp Type","Citizenships","Foreign National",null,null,"State",null,"Inv. & 2nd Home >80% LTV"]
["Choose a Selection","Choose a Selection","Choose a Selection","Choose a Selection","Choose a Selection","Choose a Selection","Choose a Selection","Choose a Selection","Choose a Selection","Choose a Selection","Choose a Selection","Choose a Selection","Choose a Selection","Choose a Selection","Choose a Selection","Choose a Selection","Choose a Selection",null,null,"Choose a Selection",null,"Not Applicable",null,{"$f":"IF(AND(OR('NonQM Program'!U10=B9:B10),OR('NonQM Program'!U19=L4:L6)),V3,V2)","v":"Not Applicable"}]
["780+","<=50","Select Standard","Select (Full/Alt)","None in this Dropdown","DTI ≤45% - All Doc Types","<$150,000","No PPP *See PPP Section*","Escrow Not Waived","Purchase","SFR","Primary","15YR Fixed","15 Day","Borrower Paid","US Citizen","Not Applicable1",null,null,"Illinois",null,"Yes",null,null,null,null,null,null," "]
["760-779","50.01-60","A+","Full Doc","Asset Utilization","DTI >45% - All Doc Types","$150,000-$1,000,000","6 Months PPP","Escrow Waived","Refinances","2 Units","Second Home","30YR Fixed","30 Day",null,"Permanent Resident","Not Applicable2",null,null,"Maryland",null,null,null,null,null,null,null,null," "]
["740-759","60.01-65","A","Alt Doc","1099 Only","DTI ≥50% - All Doc Types",">$1,000,000","12 Months PPP",null,"Debt Consol. ≤ 70% LTV","3-4 Units","Full Doc - Non-Owner","30YR IO Fixed","45 Day",null,"Non Perm Resident","Not Applicable3",null,null,"Michigan",null,null,null,null,null,null,null,null," "]
["720-739","65.01-70","B","DSCR","VOE Only","No DTI Program",">$1,500,000","24 Months PPP",null,"Debt Consol. >70% LTV","Condo","Non-Owner (Alt Doc/DSCR)","40YR IO Fixed","60 Day",null,"ITIN",null,null,null,"Minnesota",null,null,null,null,null,null,null,null," "]
["700-719","70.01-75","C",null,null,null,">$2,000,000","36 Months PPP",null,"Cash-Out ≤ 70% LTV","NW Condo",null,"40YR Fixed","75 Day",null,"Foreign Nat' With Fico",null,null,null,"North Dakota",null,null,null,null,null,null,null,null," "]
["680-699","75.01-80","Select - DSCR",null,null,null,">$2,500,000","48 Months PPP",null,"Cash-Out >70% LTV","PUD",null,"5/6 30YR ARM",null,null,null,null,null,null,"New Jersey",null,null,null,null,null,null,null,null," "]
["660-679","80.01-85","DSCR (≥1.00)",null,null,null,">$3,000,000","60 Months PPP",null,null,null,null,"5/6 30YR IO ARM",null,null,null,null,null,null,"New Mexico",null,null,null,null,null,null,null,null," "]
["640-659","85.01-90","No Ratio (0.75-0.99)",null,null,null,">$3,500,000",null,null,null,null,null,"5/6 40YR ARM",null,null,null,null,null,null,"Pennsylvania",null,null,null,null,null,null,null,null," "]
["620-639",null,null,null,null,null,">$4,000,000",null,null,null,null,null,"7/6 30YR ARM",null,null,null,null,null,null,"Texas"]
["600-619",null,null,null,null,null,null,null,null,null,null,null,"7/6 30YR IO ARM",null,null,null,null,null,null,"All Other States",null,null,null,null,null,null,null,null," "]
[null,null,null,null,null,null,null,null,null,null,null,null,"7/6 40YR ARM",null,null,null,null,null,null,null,null,null,null,null,null,null,null,null," "]
[]
[]
[" 'NonQM Program'!"]
["Feed(WS)'!"]
[]
[]
[{"$f":"'NonQM Program'!O46","v":"Max Price"},null,null,"Rules"]
[{"$f":"'NonQM Program'!O47","v":"Owner Occ/Sec Home"},null,{"$f":"'NonQM Program'!Q47","v":100},{"$f":"IF(OR('NonQM Program'!U19=L3:L4),C21,\"\")","v":""}]
[{"$f":"'NonQM Program'!O48","v":"Loans W/ No PPP"},null,{"$f":"'NonQM Program'!Q48","v":99},{"$f":"IF(AND(OR('NonQM Program'!U19=L5:L6),'NonQM Program'!U23=H3),C22,\"\")","v":""},null,null,null,null,null,null,null,null,null,null,null,null,null,null,null,null,null,null,null,null,null,null,null,null," "]
[{"$f":"'NonQM Program'!O49","v":"Loans W/ 6 Month PPP"},null,{"$f":"'NonQM Program'!Q49","v":99},{"$f":"IF(AND(OR('NonQM Program'!U19=L5:L6),'NonQM Program'!U23=H4),C23,\"\")","v":""},null,null,null,null,null,null,null,null,null,null,null,null,null,null,null,null,null,null,null,null,null,null,null,null," "]
[{"$f":"'NonQM Program'!O50","v":"Loans W/ 1YR PPP"},null,{"$f":"'NonQM Program'!Q50","v":100},{"$f":"IF(AND(OR('NonQM Program'!U19=L5:L6),'NonQM Program'!U23=H5),C24,\"\")","v":""},null,null,null,null,null,null,null,null,null,null,null,null,null,null,null,null,null,null,null,null,null,null,null,null," "]
[{"$f":"'NonQM Program'!O51","v":"Loans W/ 2YR PPP"},null,{"$f":"'NonQM Program'!Q51","v":100},{"$f":"IF(AND(OR('NonQM Program'!U19=L5:L6),'NonQM Program'!U23=H6),C25,\"\")","v":""},null,null,null,null,null,null,null,null,null,null,null,null,null,null,null,null,null,null,null,null,null,null,null,null," "]
[{"$f":"'NonQM Program'!O52","v":"Loans W/ 3YR PPP"},null,{"$f":"'NonQM Program'!Q52","v":100},{"$f":"IF(AND(OR('NonQM Program'!U19=L5:L6),'NonQM Program'!U23=H7),C26,\"\")","v":""},null,null,null,null,null,null,null,null,null,null,null,null,null,null,null,null,null,null,null,null,null,null,null,null," "]
[{"$f":"'NonQM Program'!O53","v":"Loans W/ 4YR PPP"},null,{"$f":"'NonQM Program'!Q53","v":100},{"$f":"IF(AND(OR('NonQM Program'!U19=L5:L6),'NonQM Program'!U23=H8),C27,\"\")","v":""},null,null,null,null,null,null,null,null,null,null,null,null,null,null,null,null,null,null,null,null,null,null,null,null," "]
[{"$f":"'NonQM Program'!O54","v":"Loans W/ 5YR PPP"},null,{"$f":"'NonQM Program'!Q54","v":100},{"$f":"IF(AND(OR('NonQM Program'!U19=L5:L6),'NonQM Program'!U23=H9),C28,\"\")","v":""},null,null,null,null,null,null,null,null,null,null,null,null,null,null,null,null,null,null,null,null,null,null,null,null," "]
[{"$f":"'NonQM Program'!O55","v":">$3,000,000"},null,{"$f":"'NonQM Program'!Q55","v":99.5},{"$f":"IF(OR('NonQM Program'!U17=G9:G11),C29,\"\")","v":""},null,null,null,null,null,null,null,null,null,null,null,null,null,null,null,null,null,null,null,null,null,null,null,null," "]
[{"$f":"'NonQM Program'!O56","v":"80.01-90.00% LTV"},null,{"$f":"'NonQM Program'!Q56","v":100},{"$f":"IF(OR('NonQM Program'!U10=B9:B10),C30,\"\")","v":""},null,null,null,null,null,null,null,null,null,null,null,null,null,null,null,null,null,null,null,null,null,null,null,null," "]
{"$rows_left_out":152}
{"sheet":"NonQM Program","index":1,"n_rows":69,"n_cols":29,"rows_kept":69,"cut":false,"hidden":false,"merged":[[50,0,50,4],[51,0,65,4],[11,6,11,7],[10,6,10,7],[22,6,22,16],[23,6,23,7],[24,6,24,7],[25,6,25,7],[26,6,26,7],[27,6,27,7],[28,6,28,7],[29,6,29,7],[30,6,30,7],[60,14,60,15],[60,10,73,12],[55,14,55,15],[56,14,56,15],[45,10,45,11],[53,14,53,15],[50,10,50,11],[49,14,49,15],[46,14,46,15],[35,6,35,7],[35,10,35,11],[41,21,41,24],[35,22,35,25],[47,14,47,15],[42,18,42,20],[42,21,42,24],[20,22,20,25],[35,14,35,15],[23,18,23,19],[22,22,22,25],[23,22,23,25],[32,22,32,25],[40,14,40,15],[29,18,29,20],[27,19,27,20],[27,22,28,25],[22,18,22,19],[24,18,24,19],[25,18,25,19],[44,10,44,11],[45,14,45,16],[32,18,32,20],[34,22,34,25],[28,26,28,28],[41,14,41,15],[42,10,42,12],[42,14,42,15],[31,18,31,20],[31,22,31,25],[43,10,43,11],[43,14,43,15],[28,18,28,20],[30,26,44,28],[38,22,38,25],[43,18,44,25],[33,18,38,21],[39,18,39,20],[39,21,39,25],[40,18,40,20],[40,21,40,25],[29,22,29,25],[41,18,41,20],[40,10,40,11],[37,6,37,7],[37,10,37,11],[37,14,37,15],[39,10,39,11],[38,6,38,7],[38,10,38,11],[38,14,38,15],[39,14,39,15],[36,6,36,7],[36,10,36,11],[36,14,36,15],[34,6,34,7],[34,10,34,11],[34,14,34,15],[33,10,33,11],[33,14,33,15],[32,6,32,8],[32,10,32,12],[32,14,32,16],[30,18,30,20],[8,23,8,25],[8,26,8,28],[4,12,4,13],[4,14,4,16],[7,18,7,19],[5,22,6,25],[5,18,6,21],[21,26,21,28],[15,22,16,25],[15,26,15,28],[20,18,20,19],[21,18,21,19],[12,22,12,25],[9,23,9,25],[7,26,7,28],[22,26,22,28],[26,22,26,25],[24,22,24,25],[26,19,26,20],[25,22,25,25],[19,22,19,25],[21,22,21,25],[19,18,19,19],[20,26,20,28],[8,0,8,4],[5,0,6,16],[9,26,9,28],[16,26,16,28],[19,6,19,7],[17,18,17,19],[17,22,17,25],[17,26,17,28],[20,6,20,7],[18,18,18,19],[18,22,18,25],[16,6,16,7],[14,18,14,19],[14,22,14,25],[14,26,14,28],[17,6,17,7],[15,18,15,19],[12,6,12,7],[10,18,10,19],[10,23,10,25],[10,26,10,28],[18,6,18,7],[16,18,16,19],[12,26,12,28],[0,7,1,10],[0,14,1,16],[2,7,2,10],[2,14,2,16],[3,7,3,10],[3,13,3,16],[9,6,9,7],[9,18,9,19],[8,6,8,16],[8,18,8,19],[15,6,15,7],[13,18,13,19],[13,22,13,25],[13,26,13,27],[13,6,13,7],[11,18,11,19],[11,26,11,28],[14,6,14,7],[12,18,12,19],[61,14,61,15],[62,14,62,15],[45,18,62,25],[64,14,64,16],[65,14,65,16],[66,14,66,16],[58,14,58,16],[57,11,57,12],[59,14,59,15],[58,10,58,11],[48,14,48,15],[47,10,47,12],[54,14,54,15],[50,14,50,15],[51,14,51,15],[52,14,52,15]]}
[null,null,null,null,null,null,null,null,null,null,null,null,null,null,"Wholesale Ratesheet",null,null,null,null,null,null,null,null,null,null,null,null,null,"V1.0"]
[]
[null,null,null,null,null,null,null,"19000 MacArthur Blvd, Suite 300",null,null,null,null,null,null,"30 Day Lock Period"]
[null,null,null,null,null,null,null,"Irvine, CA 92612",null,null,null,null,null,"Borrower Paid Compensation"]
[null,null,null,null,null,null,null,null,null,null,null,null,"Effective Date:",null,"2023-02-02"]
["Non QM Program Pricing",null,null,null,null,null,null,null,null,null,null,null,null,null,null,null,null,null,"NonQM Price Calculator",null,null,null,"Calculator does not verify eligibility.\nPlease use in conjunction with product matrix."]
[]
[null,null,null,null,null,null,null,null,null,null,null,null,null,null,null,null,null,null,null,null,"Inputs",null,"Wholesale Ratesheet",null,null,{"$f":"O5","v":"2023-02-02"},"Full Doc Column Includes"]
["Base Rate / Base Price",null,null,null,null,null,"FICO/LTV Price Adjustments",null,null,null,null,null,null,null,null,null,null,null,"Interest Rate",null,"Choose a Selection",null,null,null,null,null,"Tax Returns"]
["Coupon","Select (Full/Alt)","Full Doc","Alt Doc","DSCR",null,null,null,"<=50","50.01-60","60.01-65","65.01-70","70.01-75","75.01-80","80.01-85","85.01-90","90.01-95",null,"LTV Range",null,"Choose a Selection",null,null,null,null,null,"1099 Only"]
[6.75,99.25,{"$error":"#N/A"},{"$error":"#N/A"},{"$error":"#N/A"},null,"780+",null,0,0,-0.25,-0.5,-1,-1.5,-3.5,-4.75,{"$error":"#N/A"},null,"FICO Range",null,"Choose a Selection",{"$f":"IF(U12='Feed(WS)'!C3,INDEX($G$24:$Q$31,MATCH(U11,$G$24:$G$31,0),MATCH(U10,$G$24:$Q$24,0)),(INDEX(I11:Q21,MATCH(U11,G11:G21,0),MATCH(U10,I10:Q10))))","v":{"$error":"#N/A"}},null,null,null,null,"Asset Utilization Only"]
[6.875,99.5,99.5,99.5,{"$error":"#N/A"},null,"760-779",null,-0.125,-0.125,-0.375,-0.625,-1.125,-1.625,-3.625,-4.875,{"$error":"#N/A"},null,"Grade",null,"Choose a Selection",{"$f":"IF(U12=\"Choose a Selection\",0,(INDEX(M34:M41,MATCH(U12,K34:K41,0))))","v":0},null,null,null,null,"Asset Utilization W/ Full Doc"]
[6.9989999999999997,99.75,99.75,99.75,{"$error":"#N/A"},null,"740-759",null,-0.25,-0.25,-0.5,-0.75,-1.25,-1.75,-3.75,-5,{"$error":"#N/A"},null,"Doc Type",null,"Choose a Selection",null,{"$f":"'Feed(WS)'!B64","v":0},null,null,null,"VOE"]
[7.125,100,100,100,99.5,null,"720-739",null,-0.25,-0.5,-0.75,-1.25,-1.75,-2.25,-4.25,-5.5,{"$error":"#N/A"},null,"Additional Adjs",null,"Choose a Selection",{"$f":"IF(AND(OR(U10='Feed(WS)'!B9:B10),OR(U14='Feed(WS)'!E4:E6)),NA(),IF((AND((IF(U10=\"85.01-90\",1,0))=1,(IF(U13=\"DSCR\",1,0))=1))=TRUE,NA(),(IF(OR((AND(OR(U11='Feed(WS)'!$A$7:$A$12),IF(U10=\"80.01-85\",1,0),IF(U13=\"DSCR\",1,0)))=TRUE,(AND(OR(U11='Feed(WS)'!A6:A12),IF(U10=\"80.01-85\",1,0),IF(U13=\"DSCR\",1,0),OR(U18='Feed(WS)'!J4:J9))=TRUE)),NA(),IF(U14=\"Choose a Selection\",0,(IF(U14=\"None in this Dropdown\",0,IF(U14=\"12 Month Full / Alt Doc\",0,INDEX(I$35:I$69,MATCH(U14,G$35:G$69,0))))))))))","v":0}]
[7.25,100.25,100.25,100.25,99.75,null,"700-719",null,-0.5,-1,-1.5,-2,-2.5,-3,-4.75,-6,{"$error":"#N/A"},null,"Citizenships",null,"Choose a Selection",{"$f":"(IF(U15=\"US Citizen\",0,(IF(U15=\"Permanent Resident\",0,(IF(U15=\"Non Perm Resident\",0,(IF(U15=\"ITIN\",VLOOKUP(U15,G35:I69,3,0),(IF(U15=\"Foreign Nat' No Fico\",INDEX(I13:Q21,MATCH(U15,G13:G21,0),MATCH(U10,I10:Q10)),IF(U15=\"Foreign Nat' With Fico\",IF(U15=\"Foreign Nat' With Fico\",INDEX(G35:I69,(MATCH(U15,G35:G69,0)),3)),NA())))))))))))","v":{"$error":"#N/A"}},"No Ratio 0.75 - 0.99 (Review Matrix for LTV Qualification) ",null,null,null,"Alt Doc Column Includes"]
[7.375,100.5,100.5,100.5,100,null,"680-699",null,-0.75,-1.5,-2.25,-2.75,-3.25,-3.75,{"$error":"#N/A"},{"$error":"#N/A"},{"$error":"#N/A"},null,"DTI",null,"Choose a Selection",{"$f":"IF(U16=\"DTI ≥50% - All Doc Types\",IF((AND(IF(U16=\"DTI ≥50% - All Doc Types\",1,0),(IF(U18=\"Purchase\",1,0)),(IF(U19=\"Primary\",1,0)),(IF(OR(U10='Feed(WS)'!B3:B8),1,0)),(IF(OR(U11='Feed(WS)'!A6:A9),1,0)),(IF(U12=\"A+\",1,0)))),IF(U16=\"Choose a Selection\",0,(IF(U16=\"DTI  ≤45% - All Doc Types\",0,IF(U16=\"No DTI Program\",0,INDEX(I$35:I$69,MATCH(U16,G$35:G$69,0)))))),NA()), IF((AND(IF(U16=\"DTI ≥50% - All Doc Types\",1,0),(IF(U18<>\"Purchase\",1,0)))),NA(),IF(U16=\"Choose a Selection\",0,(IF(U16=\"DTI ≤45% - All Doc Types\",0,IF(U16=\"No DTI Program\",0,INDEX(I$35:I$69,MATCH(U16,G$35:G$69,0))))))))","v":0},null,null,null,null,"12 Bank Statements"]
[7.4989999999999997,100.75,100.75,100.75,100.25,null,"660-679",null,-1.25,-2,-2.75,-3.25,-3.75,-4.25,{"$error":"#N/A"},{"$error":"#N/A"},{"$error":"#N/A"},null,"Loan Balance",null,"Choose a Selection",{"$f":"IF(U17=\"Choose a Selection\",0,((IF(U17=\"$5,000,001-$7,500,000\",\"Call Lock Desk\",IF(U17=\"$7,500,001-$10,000,000\",\"Call Lock Desk\",INDEX(I$35:I$69,MATCH(U17,G$35:G$69,0)))))))","v":0},null,null,null,null,"12 or 24 CPA P&L"]
[7.625,101,101,101,100.5,null,"640-659",null,-2,-2.75,-3.5,-4,-4.75,-5.5,{"$error":"#N/A"},{"$error":"#N/A"},{"$error":"#N/A"},null,"Purpose",null,"Choose a Selection",{"$f":"IF(AND(OR(U18='Feed(WS)'!J5:J9),U10=\"85.01-90\"),NA(),IF(ISERROR(IF(OR(U18=\"Purchase\",U18=\"Rate/Term Refi\"),0,INDEX(I$35:I$69,MATCH(U18,G$35:G$69,0)))),0,INDEX(I$35:I$69,MATCH(U18,G$35:G$69,0))))","v":0},null,null,null,null,"Asset Utlization W/ Bank Stmt"]
[7.75,101.25,101.25,101.25,100.75,null,"620-639",null,-2.5,-3.25,-4,-4.75,-5.5,-6.25,{"$error":"#N/A"},{"$error":"#N/A"},{"$error":"#N/A"},null,"Occupancy",null,"Choose a Selection",{"$f":"IF(OR('Feed(WS)'!A66:A70=TRUE),IF(U19=\"Choose a Selection\",0,(IF(OR(U19=\"Primary\"),0,IF(OR(U19=\"Non-Owner (Alt Doc/DSCR)\"),0,INDEX(I$35:I$69,MATCH(U19,G$35:G$69,0)))))),NA())","v":{"$error":"#N/A"}}]
[7.875,101.5,101.5,101.5,101,null,"600-619",null,-3,-3.75,-4.5,-5.25,-6.25,-7.25,{"$error":"#N/A"},{"$error":"#N/A"},{"$error":"#N/A"},null,"Property Type",null,"Choose a Selection",{"$f":"IF(AND(OR(U10='Feed(WS)'!B8:B10),OR(U20='Feed(WS)'!K7)),NA(),IF(U17=\"Choose a Selection\",0,(IF(OR(U20=\"SFR\",U20=\"1-2 Units\",U20=\"PUD\",U20=\"Condo\"),0,INDEX(I$35:I$69,MATCH(U20,G$35:G$69,0))))))","v":0}]
[7.9989999999999997,101.75,102,102,101.5,null,"Foreign Nat' No Fico",null,{"$error":"#N/A"},{"$error":"#N/A"},{"$error":"#N/A"},{"$error":"#N/A"},{"$error":"#N/A"},{"$error":"#N/A"},{"$error":"#N/A"},{"$error":"#N/A"},{"$error":"#N/A"},null,"Loan Term",null,"30YR Fixed",{"$f":"IF(AND(U10='Feed(WS)'!B10,OR(U21='Feed(WS)'!M5:M6,U21='Feed(WS)'!M9,U21='Feed(WS)'!M12)),NA(),INDEX(Q34:Q44,MATCH(U21,O34:O44,0)))","v":0},null,null,null,null,"DSCR/No Ratio Column Includes"]
[8.125,102,102.25,102.25,101.75,null,null,null,null,null,null,null,null,null,null,null,null,null,"Escrow",null,"Escrow Not Waived",{"$f":"IF(U22=\"Escrow Not Waived\",0,INDEX(I$35:I$69,MATCH(U22,G$35:G$69,0)))","v":0},null,null,null,null,"DSCR"]
[8.25,102.25,102.5,102.5,102,null,"Select (Full/Alt) FICO/LTV Price Adjustments",null,null,null,null,null,null,null,null,null,null,null,"Prepayment Penalty",null,"No PPP *See PPP Section*",{"$f":"IF(OR(U19=\"Primary\",U19=\"Second Home\"),0,INDEX(I$35:I$69,MATCH(U23,G$35:G$69,0)))","v":-1.5},"MINIMUM 3 YEAR PPP REQUIRED ON >80% LTVs",null,null,null,"No Ratio"]
[8.375,102.5,102.75,102.75,102.25,null,null,null,"<=50","50.01-60","60.01-65","65.01-70","70.01-75","75.01-80","80.01-85","85.01-90","90.01-95",null,"State",null,"All Other States",0,null,null,null,null,"V100521"]
[8.4990000000000006,{"$error":"#N/A"},103,103,102.5,null,"780+",null,0.5,0.375,0.25,0.125,-0.125,-0.375,-1.625,-2.75,{"$error":"#N/A"},null,"Lock Term",null,"30 Day",{"$f":"INDEX(M44:M46,MATCH(U25,K44:K46,0))","v":0},null,null,null,null,"V091721"]
[8.625,{"$error":"#N/A"},103.25,103.25,102.75,null,"760-779",null,0.5,0.375,0.25,0.125,-0.125,-0.375,-1.625,-2.875,{"$error":"#N/A"},null,{"$f":"IF(U26='Feed(WS)'!V2,\"\",\"Inv. & 2nd Home >80% LTV\")","v":""},null,{"$f":"'Feed(WS)'!X2","v":"Not Applicable"},{"$f":"IF(U26='Feed(WS)'!V2,\"\",IF(U26='Feed(WS)'!V3,VLOOKUP('Feed(WS)'!V1,G$35:I$69,3),0))","v":""},null,null,null,null,"V110121"]
[8.75,{"$error":"#N/A"},103.5,103.5,103,null,"740-759",null,0.375,0.25,0.125,0,-0.25,-0.5,-2,-3.375,{"$error":"#N/A"},null,null,null,null,null,0,null,null,null,"V121021.1"]
[8.875,{"$error":"#N/A"},103.75,103.75,103.25,null,"720-739",null,0.25,0.125,0,-0.125,-0.375,-0.625,-2.5,-3.875,{"$error":"#N/A"},null,null,null,null,null,"Calculator does not verify eligibility.\nPlease use in conjunction with product matrix.",null,null,null,"V20220120.0"]
[8.9990000000000006,{"$error":"#N/A"},104.25,104.25,103.75,null,"700-719",null,0.125,0,-0.125,-0.5,-0.875,-1.125,-3.375,{"$error":"#N/A"},{"$error":"#N/A"},null,"  Total LLPA",null,null,{"$f":"SUM(V11:V28)+W13","v":{"$error":"#N/A"}},null,null,null,null,"*** Extension Cost"]
[9.125,{"$error":"#N/A"},104.5,104.5,104,null,"680-699",null,0,-0.25,-0.5,-0.875,-1.375,-1.625,{"$error":"#N/A"},{"$error":"#N/A"},{"$error":"#N/A"},null,"  Gross Rate Sheet Price (Prior to LLPAs)",null,null,{"$f":"INDEX(A10:E49,MATCH(U9,A10:A49,0),MATCH(U13,B10:E10,0)+1)","v":{"$error":"#N/A"}}]
{"$rows_left_out":40}
{"sheet":"Cover Page","index":2,"n_rows":45,"n_cols":18,"rows_kept":45,"cut":false,"hidden":true,"merged":[[24,4,24,5],[26,6,26,8],[27,6,27,8],[25,4,25,5],[27,4,27,5],[25,6,25,8],[20,6,20,8],[20,2,20,3],[20,4,20,5],[36,17,36,19],[25,13,26,15],[27,13,28,15],[32,17,32,19],[30,17,30,19],[28,17,28,19],[26,17,26,19],[30,4,30,5],[21,6,21,8],[22,6,22,8],[23,6,23,8],[24,6,24,8],[28,6,28,8],[23,13,24,15],[11,1,11,21],[15,17,15,19],[24,17,24,19],[13,8,13,10],[14,8,16,10],[19,13,20,15],[17,13,18,15],[13,5,13,6],[18,17,18,20],[14,5,14,6],[20,17,20,19],[14,13,16,15],[19,2,19,9],[21,13,22,15],[24,2,24,3],[28,2,28,3],[28,4,28,5],[25,2,25,3],[27,2,27,3],[26,2,26,3],[26,4,26,5],[21,2,21,3],[21,4,21,5],[22,2,22,3],[22,4,22,5],[23,2,23,3],[23,4,23,5],[13,13,13,20],[13,2,13,4],[14,3,14,4],[15,2,15,4],[16,2,16,4],[15,5,15,6],[16,5,16,6],[44,1,44,21],[43,1,43,21],[36,2,36,3],[38,2,38,3],[36,5,36,6],[38,5,38,6],[36,8,36,9],[38,8,38,9],[38,17,38,19],[29,13,38,15],[29,2,29,3],[29,4,29,5],[30,6,30,8],[29,6,29,8],[30,2,30,3],[34,17,34,19]]}
[]
[]
[]
[]
[null,null,null,null,null,null,null,null,null,"19000 MacArthur Boulevard, 2nd Floor"]
[null,null,null,null,null,null,null,null,null,"Irvine, CA 92612"]
[]
[]
[]
[]
[]
[null,"LoanStream Mortgage Wholesale NANQ Rate Sheet"]
[]
[null,null,"Underwriting Fee",null,null,"Relock Fee",null,null,"Mortgagee Clause",null,null,null,null,"Contact list"]
[null,null,"NANQ",1295,null,-0.25,null,null,"OCMBC, INC. ISAOA \n19000 MacArthur Blvd, Ste. 200 Irvine, CA 92612",null,null,null,null,"Corporate \nHeadquarters:",null,null,"Phone:","800-760-1833"]
[null,null,"DOC Fee - All Loans",null,null,"Extension Fee",null,null,null,null,null,null,null,null,null,null,"Email:","Inquires@LSMortgage.com"]
[null,null,79,null,null,"0.02/Day"]
[null,null,null,null,null,null,null,null,null,null,null,null,null,"NAN-Q\n Prequals",null,null,"Phone:","Email Only"]
[null,null,null,null,null,null,null,null,null,null,null,null,null,null,null,null,"Email:","EZQual@LSMortgage.com"]
[null,null,"Current Turn Times",null,null,null,null,null,null,null,null,null,null,"U/W Loan \nScenarios NAN-Q",null,null,"Phone:","Email Only"]
[null,null,"Stage",null,"Turn Times",null,"Department Hours",null,null,"Cutoff Time",null,null,null,null,null,null,"Email:","NANQScenario@LSMortgage.com"]
[null,null,"PreQual",null,"24-48 Hours",null,"PreQual Desk Hours: 8:00 AM-5:00 PM PST",null,null,"3:00 PM PST",null,null,null,"Submission Desk",null,null,"Phone:","Email Only"]
[null,null,"Set-up",null,"24-48 Hours",null,"Setup Desk Hours: 8:00 AM-6:00 PM PST",null,null,null,null,null,null,null,null,null,"Email:","Submissions_LS@LSMortgage.com"]
[null,null,"New Underwrite",null,"24-48 Hours",null,"Underwriting Hours: 7:00 AM-6:00 PM PST",null,null,"3:00 PM PST",null,null,null,"Lock Desk:",null,null,"Phone:","949-679-7059"]
[null,null,"Conditions Review",null,"24-48 Hours",null,"Underwriting Hours: 7:00 AM-6:00 PM PST",null,null,"3:00 PM PST",null,null,null,null,null,null,"Email:","LockDesk@LSMortgage.com"]
[null,null,"Part \"A\" QC",null,"48-72 Hours",null,"PreQual Desk Hours: 8:00 AM-5:00 PM PST",null,null,"3:30 PM PST",null,null,null,"CD Desk:",null,null,"Phone:","Email Only"]
[null,null,"Lock Desk",null,"SameDay",null,"Lock Desk Hours are: 8:30 AM - 5:00 PM PST",null,null,"5:00 PM PST",null,null,null,null,null,null,"Email:","CD@LSMortgage.com"]
[null,null,"CTC Review",null,"SameDay",null,"Underwriting Hours: 7:00 AM-6:00 PM PST",null,null,"1:00 PM PST",null,null,null,"Funding Department:",null,null,"Phone:","Email Only"]
[null,null,"CD",null,"SameDay",null,"CD Desk Hours: 7:30 AM-6:00 PM PST",null,null,"12:00 PM PST",null,null,null,null,null,null,"Email:","Funding@LSMortgage.com"]
[null,null,"DOCS",null,"SameDay",null,"DOCS Desk Hours: 7:30 AM-6:00 PM PST",null,null,"12:00 PM PST",null,null,null,"Management \nEscalations",null,null,"Name:","David Racer / Operations"]
{"$rows_left_out":16}
{"sheet":"Sheet1","index":3,"n_rows":0,"n_cols":0,"rows_kept":0,"cut":false,"hidden":true,"merged":[]}